{"text_format":"1","workbook":"xlsx","n_sheets":2,"sheets":["Milieu Verklaring","Afbeeldingen"],"not_rendered":{"charts":0,"images":37,"macros":1,"external_links":0,"defined_names":3,"comments":1,"pivot_tables":0},"unopened":[],"bounds":{"document_bytes":16777216,"sheet_cells":100000,"rows_first":2000,"rows_last":500,"rows_between":2000,"halvings":0,"cell_chars":16384,"cell_head_chars":4096},"cells_cut":0,"cells_raw":0,"read":"whole","date_system":"1900"}

{"sheet":"Milieu Verklaring","index":0,"n_rows":149,"n_cols":36,"rows_kept":149,"cut":false,"hidden":false,"merged":[[5,6,6,8],[29,1,29,8],[62,6,62,7],[67,2,67,6],[71,2,71,6],[34,1,34,8],[33,1,33,8],[37,1,37,8],[15,1,15,8],[16,1,16,8],[31,1,31,8],[32,1,32,8],[69,2,69,4],[74,1,74,8],[76,1,76,8],[78,1,78,8],[85,6,85,8],[75,1,75,8],[77,1,77,8],[91,1,92,8],[0,1,0,8],[2,1,2,8],[22,1,22,5],[11,1,11,8],[13,1,13,8],[12,1,12,8],[35,1,35,8],[50,1,50,8],[72,1,72,8],[40,1,40,8],[39,1,39,8],[85,1,87,3],[24,1,24,3],[26,1,26,3],[17,1,17,8],[87,6,89,8],[83,1,83,2],[41,1,41,8],[65,2,65,4],[53,1,53,8],[21,2,21,4],[86,6,86,7],[42,1,42,8],[51,3,51,6],[38,1,38,8],[66,1,66,8],[44,3,44,8],[46,3,46,8],[48,3,48,8],[80,1,81,8]]}
[null,"Milieuverklaring (bestemd voor eenmalig gebruik)",null,null,null,null,null,null,null,null,null,"Rbk 2022, par. 5.3 MV op grond van een BKK"]
[]
[null,"Verklaring gebaseerd op een vast gestelde bodemkwaliteitskaart (BKK)",null,null,null,null,null,null,null,null,null,"Rbk, par. 5.3"]
[]
[]
[null,"Uniek nummer van de verklaring:",null,null,null,null,"<nummer>",null,null,null,null,"Rbk, art. 5.36 lid 1i",{"$f":"IF(G6=\"<nummer>\",1,0)","v":1}]
[null,null,null,null,null,null,null,null,null,null,null,null,null,null,null,null,null,"Grond","[rolmenu ↓]"]
[null,"Deze verklaring heeft betrekking op een partij",null,null,null,null,"grond",null,null,null,null,"Rbk, art. 5.36 lid 1a",true,{"$f":"IF(AND(M8=TRUE,M9=FALSE),1,0)","v":1},null,null,null,null,"Landbouw/Natuur (AW2000)"]
[null,null,null,{"$f":"IF(AND(N8=0,N9=0),\"1 hokje aanvinken\",\"\")","v":""},null,null,"baggerspecie",null,null,null,null,"Rbk, art. 5.36 lid 1a",false,{"$f":"IF(AND(M8=FALSE,M9=TRUE),1,0)","v":0},null,null,null,null,"Wonen"]
[null,null,null,null,null,null,null,null,null,null,null,null,null,null,null,null,null,null,"Industrie"]
[null,"Beperking van de geldigheid van de MV",null,null,null,null,null,null,null,null,null,"Rbk, art. 5.36 lid 1b",null,null,null,null,null,null,"Matig verontreinigd"]
[null,"\"Van deze verklaring mag bij het toepassen van de partij grond of baggerspecie waarvoor zij is afgegeven, alleen gebruik",null,null,null,null,null,null,null,null,null,null,null,null,null,null,null,null,"Sterk verontreinigd"]
[null,"worden gemaakt wanneer dit volgens artikel 5.32 van de Regeling bodemkwaliteit 2022 is toegestaan.\"",null,null,null,null,null,null,null,null,null,null,null,null,null,null,null,null,"Niet-toepasbaar"]
[null,null,null,null,null,null,null,null,null,null,null,null,null,null,null,null,null,null,"n.v.t."]
[null,"Naam en adres van de persoon die onderhavige verklaring afgeeft",null,null,null,null,null,null,null,null,null,"Rbk, art. 5.36 lid 1c"]
[null,"<naam>",null,null,null,null,null,null,null,null,null,null,{"$f":"IF(B16=\"<naam>\",1,0)","v":1}]
[null,"<postcode en plaatsnaam>",null,null,null,null,null,null,null,null,null,null,{"$f":"IF(B17=\"<postcode en plaatsnaam>\",1,0)","v":1}]
[null,"<straatnaam en nummer>",null,null,null,null,null,null,null,null,null,null,{"$f":"IF(B18=\"<straatnaam en nummer>\",1,0)","v":1}]
[]
[]
[null,"Bodemkwaliteitskaart die die de grondslag biedt voor de afgegeven MV:",null,null,null,null,null,null,null,null,null,"Rbk, art. 5.36 lid 1d",null,null,null,null,null,null,null,null,null,null,null,null,null,null,null,null,null,null,null,"zone Sit-Gel","[rolmenu ↓]",null,"bodemlaag","[rolmenu ↓]"]
[null,"Gemeente","[rolmenu ↓]",null,null,null,null,null,null,null,null,null,{"$f":"IF(C22=\"[rolmenu ↓]\",1,0)","v":1},null,null,null,null,"[rolmenu ↓]","[rolmenu ↓]",null,null,null,null,null,null,null,null,null,null,null,null,null,"Wonen \"oud\"",null,null,"0,0-0,5 m-mv"]
[null,{"$f":"IF(C22=\"[rolmenu ↓]\",\"BKK\",VLOOKUP(C22,R23:S60,2,FALSE))","v":"BKK"},null,null,null,null,null,null,null,null,null,null,null,null,null,null,null,"Beek","Bodemfunctieklassenkaart en bodemkwaliteitskaart Gemeenten Beek, Beekdaelen en Stein",null,null,null,null,null,null,null,null,null,null,null,null,null,"Wonen \"nieuw\"",null,null,"0,5-3,5 m-mv"]
[null,"De ontgravingslocatie ligt in de zone:",null,null,null,null,null,null,null,null,null,"Rbk, art. 5.36 lid 1d",null,null,null,null,null,"Brunssum","BKK",null,null,null,null,null,null,null,null,null,null,null,null,null,"Industrie",null,null,"0,5-2,0 m-mv"]
[null,"[rolmenu ↓]",null,null,null,null,null,null,null,null,null,null,{"$f":"IF(B25=\"[rolmenu ↓]\",1,0)","v":1},null,null,null,null,"Eijsden-Margraten","BKK",null,null,null,null,null,null,null,null,null,null,null,null,null,"Buitengebied"]
[null,"De ontgraving vindt plaats uit de bodemlaag:",null,null,null,null,null,null,null,null,null,"Rbk, art. 5.36 lid 1d",null,null,null,null,null,"Gulpen-Wittem","BKK"]
[null,"[rolmenu ↓]",null,null,null,null,null,null,null,null,null,null,{"$f":"IF(B27=\"[rolmenu ↓]\",1,0)","v":1},null,null,null,null,"Heerlen","BKK"]
[null,null,null,null,null,null,null,null,null,null,null,null,null,null,null,null,null,"Kerkrade","BKK"]
[null,"Het unieke nummer van het rapport van het vooronderzoek (vo) NEN5725/NEN5717",null,null,null,null,null,null,null,null,null,"Rbk, art. 5.36 lid 1e",null,null,null,null,null,"Landgraaf","BKK"]
[null,"<uniek nummer rapport>",null,null,null,null,null,null,null,null,null,null,{"$f":"IF(B30=\"<uniek nummer rapport>\",1,0)","v":1},null,null,null,null,"Maastricht","BKK"]
[null,"Naam en adres van de persoon die het vooronderzoek heeft verricht",null,null,null,null,null,null,null,null,null,"Rbk, art. 5.36 lid 1g",null,null,null,null,null,"Meerssen","BKK"]
[null,"<naam onderzoeksbureau en naam contactpersoon>",null,null,null,null,null,null,null,null,null,null,{"$f":"IF(B32=\"<naam onderzoeksbureau en naam contactpersoon>\",1,0)","v":1},null,null,null,null,"Beekdaelen","Bodemfunctieklassenkaart en bodemkwaliteitskaart Gemeenten Beek, Beekdaelen en Stein"]
[null,"<postcode en plaatsnaam>",null,null,null,null,null,null,null,null,null,null,{"$f":"IF(B33=\"<postcode en plaatsnaam>\",1,0)","v":1},null,null,null,null,"Beekdaelen","Bodemfunctieklassenkaart en bodemkwaliteitskaart Gemeenten Beek, Beekdaelen en Stein"]
[null,"<straatnaam en nummer>",null,null,null,null,null,null,null,null,null,null,{"$f":"IF(B34=\"<straatnaam en nummer>\",1,0)","v":1},null,null,null,null,"Beekdaelen","Bodemfunctieklassenkaart en bodemkwaliteitskaart Gemeenten Beek, Beekdaelen en Stein"]
[]
[null,"Is er een aanvullend onderzoek onderzoek NEN5740/NEN5720 uitgevoerd?",null,null,null,null,null,null,null,null,null,"Rbk, art. 5.36 lid 1e",null,null,null,null,null,"Sittard-Geleen","Bodemkwaliteits- en bodemfunctieklassenkaart gemeente Sittard-Geleen 2021-2025"]
[null,null,{"$f":"IF(N37=TRUE,\"ja\",\"nee\")","v":"nee"},null,null,null,null,null,null,null,null,null,null,false]
[null,"<uniek nummer rapport>",null,null,null,null,null,null,null,null,null,null,{"$f":"IF(B38=\"<uniek nummer rapport>\",1,0)","v":1},null,null,null,null,"Stein","Bodemfunctieklassenkaart en bodemkwaliteitskaart Gemeenten Beek, Beekdaelen en Stein"]
[null,"Naam en adres van de persoon die het aanvullend onderzoek heeft verricht",null,null,null,null,null,null,null,null,null,"Rbk, art. 5.36 lid 1g",null,null,null,null,null,"Vaals","BKK"]
[null,"<naam onderzoeksbureau en naam contactpersoon>",null,null,null,null,null,null,null,null,null,null,{"$f":"IF(B40=\"<naam onderzoeksbureau en naam contactpersoon>\",1,0)","v":1},null,null,null,null,"Valkenburg a/d Geul","BKK"]
[null,"<postcode en plaatsnaam>",null,null,null,null,null,null,null,null,null,null,{"$f":"IF(B41=\"<postcode en plaatsnaam>\",1,0)","v":1},null,null,null,null,"Voerendaal","BKK"]
[null,"<straatnaam en nummer>",null,null,null,null,null,null,null,null,null,null,{"$f":"IF(B42=\"<straatnaam en nummer>\",1,0)","v":1},null,null,null,null,"IMD-BNS","BKK"]
[]
[null,{"$f":"IF(N44=TRUE,\"      het a.o. geeft voldoende informatie over de aanwezigheid van stoffen uit bijlage B waarover de BKK geen informatie geeft\",\"      het a.o. geeft niet voldoende informatie over de aanwezigheid van stoffen uit bijlage B waarover de BKK geen informatie geeft\")","v":"      het a.o. geeft niet voldoende informatie over de aanwezigheid van stoffen uit bijlage B waarover de BKK geen informatie geeft"},null,null,null,null,null,null,null,null,null,"Rbk, art 5.36 lid 2",null,false,null,null,null,"Mook en Middelaar","BKK"]
[null,"concentratie van deze stoffen:",null,{"$f":"IF(N44=TRUE,\"zie bijlage\",\"\")","v":""},null,null,null,null,null,null,null,null,{"$f":"IF(ISTEXT(D45)=TRUE,1,0)","v":1},null,null,null,null,"Gennep","BKK"]
[null,{"$f":"IF(N46=TRUE,\"      het a.o. geeft voldoende info over de aanwezigheid van andere stoffen dan bijl.B waarover de BKK geen informatie geeft\",\"      het a.o. geeft niet voldoende info over de aanwezigheid van andere stoffen dan bijl.B waarover de BKK geen informatie geeft\")","v":"      het a.o. geeft niet voldoende info over de aanwezigheid van andere stoffen dan bijl.B waarover de BKK geen informatie geeft"},null,null,null,null,null,null,null,null,null,"Rbk, art 5.36 lid 2",null,false,null,null,null,"Bergen","BKK"]
[null,"concentratie van deze stoffen:",null,{"$f":"IF(N46=TRUE,\"zie bijlage\",\"\")","v":""},null,null,null,null,null,null,null,null,{"$f":"IF(ISTEXT(D47)=TRUE,1,0)","v":1},null,null,null,null,"Venray","BKK"]
[null,{"$f":"IF(N48=TRUE,\"      het a.o. geeft voldoende info over de aanwezigheid van bodemvreemd materiaal waarover de BKK geen informatie geeft\",\"      het a.o. geeft niet voldoende info over de aanwezigheid van bodemvreemd materiaal waarover de BKK geen informatie geeft\")","v":"      het a.o. geeft niet voldoende info over de aanwezigheid van bodemvreemd materiaal waarover de BKK geen informatie geeft"},null,null,null,null,null,null,null,null,null,"Rbk, art 5.36 lid 2",null,false,null,null,null,"Horst aan de Maas","BKK"]
[null,"aard en hoeveelheid b.v.m.:",null,{"$f":"IF(N48=TRUE,\"zie bijlage\",\"\")","v":""},null,null,null,null,null,null,null,null,{"$f":"IF(ISTEXT(D49)=TRUE,1,0)","v":1},null,null,null,null,"Venlo","BKK"]
[null,null,null,null,null,null,null,null,null,null,null,null,null,null,null,null,null,"Peel en Maas","BKK"]
[null,"Concludeert het vooronderzoek dat de BKK een getrouw en actueel beeld van de kwaliteit van de bodem op de ontgravingslocatie geeft?",null,null,null,null,null,null,null,null,null,"Rbk, art. 5.36 lid 1f",null,null,null,null,null,"Nederweert","BKK"]
[null,null,{"$f":"IF(M52=TRUE,\"ja\",\"nee\")","v":"ja"},{"$f":"IF(C52=\"nee\",\"Afgifte van onderhavige MV is niet mogelijk\",\"\")","v":""},null,null,null,null,null,null,null,null,true,true,null,null,null,"Beesel","BKK"]
[null,"onderbouwing van deze conclusie:",null,null,null,null,null,null,null,null,null,"Rbk, art. 5.36 lid 1f",null,null,null,null,null,"Leudal","BKK"]
[null,"<onderbouwing>",null,null,null,null,null,null,null,null,null,null,{"$f":"IF(B54=\"<onderbouwing>\",1,0)","v":1},null,null,null,null,"Weert","BKK"]
[null,"Nauwkeurige omschrijving van het type grond of baggerspecie",null,null,null,null,null,null,null,null,null,"Rbk, art. 5.36 lid 1h1",null,null,null,null,null,"Roermond","BKK",null,"code bodemsoort","bodemsoort","code toevoeging bodemsoort","toevoeging","code gradatie toevoeging bodemsoort","gradatie","code bijzonderbestanddeel","bijzonderbestanddeel","code gradatie bijzonder bestanddeel","gradatie"]
[null,"type grond",null,"[rolmenu ↓]",{"$f":"IF(D56=\"[rolmenu ↓]\",\"\",VLOOKUP(D56,U56:V62,2,FALSE))","v":""},{"$f":"IF(N56=TRUE,\"        de volgende kenmerken zijn bekend\",\"        de volgende kenmerken zijn niet bekend\")","v":"        de volgende kenmerken zijn niet bekend"},null,null,null,null,null,null,{"$f":"IF(D56=\"[rolmenu ↓]\",1,0)","v":1},false,null,null,null,"Maasgouw","BKK",null,"[rolmenu ↓]","[rolmenu ↓]","[rolmenu ↓]","[rolmenu ↓]","[rolmenu ↓]","[rolmenu ↓]","[rolmenu ↓]","[rolmenu ↓]","[rolmenu ↓]","[rolmenu ↓]"]
[null,"toevoeging",null,"[rolmenu ↓]",{"$f":"IF(D57=\"[rolmenu ↓]\",\"\",VLOOKUP(D57,W56:X62,2,FALSE))","v":""},null,null,null,null,null,null,null,{"$f":"IF(D57=\"[rolmenu ↓]\",1,0)","v":1},null,null,null,null,"Roerdalen","BKK",null,"L","leem","S","siltig",1,"zwak","AA","aardewerk",1,"zwak 1-5%"]
[null,"gradatie",null,"[rolmenu ↓]",{"$f":"IF(D58=\"[rolmenu ↓]\",\"\",VLOOKUP(D58,Y56:Z61,2,FALSE))","v":""},null,null,null,null,null,null,null,1,null,null,null,null,"Echt-Susteren","BKK",null,"Z","zand","Z","zandig",2,"matig","AB","asbest",2,"matig 5-10%"]
[null,"bijzonder bestanddeel",null,"[rolmenu ↓]",{"$f":"IF(D59=\"[rolmenu ↓]\",\"\",VLOOKUP(D59,AA56:AB112,2,FALSE))","v":""},"[rolmenu ↓]",{"$f":"IF(F59=\"[rolmenu ↓]\",\"\",VLOOKUP(F59,AA56:AB112,2,FALSE))","v":""},"[rolmenu ↓]",{"$f":"IF(H59=\"[rolmenu ↓]\",\"\",VLOOKUP(H59,AA56:AB112,2,FALSE))","v":""},null,null,null,1,null,1,null,1,"Servicecentrum MER","BKK",null,"K","klei","K","kleiig",3,"sterk","AF","afval",3,"sterk 10-20%"]
[null,"gradatie",null,"[rolmenu ↓]",{"$f":"IF(D60=\"[rolmenu ↓]\",\"\",VLOOKUP(D60,AC56:AD66,2,FALSE))","v":""},null,null,null,null,null,null,null,1,null,null,null,null,"volgt","BKK",null,"G","grind","G","grindig",4,"uiterst","AS","asfalt",4,"uiterst 20-50%"]
[null,null,null,null,null,null,null,null,null,null,null,null,null,null,null,null,null,null,null,null,"V","veen","H","humeus",null,null,"BA","baksteen",5,"volledig >50%"]
[null,"De grootte van de partij",null,null,null,null,null,null,null,null,null,"Rbk, art. 5.36 lid 1h2",null,null,null,null,null,null,null,null,"Divers","zie bijlage",null,null,null,null,"BE","beton",6,"sporen"]
[null,"<ton>","ton","<m3>","m3",null,{"$f":"IF(AND(M63=TRUE,N63=TRUE),\"dichtheid (ton/m3): \",\"\")","v":""},null,{"$f":"IF(AND(M63=TRUE,N63=TRUE),B63/D63,\"\")","v":""},null,null,null,{"$f":"ISNUMBER(B63)","v":false},{"$f":"ISNUMBER(D63)","v":false},null,null,null,null,null,null,null,null,null,null,null,null,"BI","bitumen",7,"resten"]
[null,null,null,null,null,null,null,null,null,null,null,null,null,null,null,null,null,null,null,null,null,null,null,null,null,null,"BL","ballast",8,"brokken"]
[null,"Kwaliteitsklasse waarin de partij grond is ingedeeld",null,null,null,null,null,null,null,null,null,"Rbk, art. 5.36 lid 1h3",null,null,null,null,null,null,null,null,null,null,null,null,null,null,"BR","bruinkool",9,"laagjes"]
[null,"klasse:","[rolmenu ↓]",null,null,{"$f":"IF(N66=TRUE,\"        de volgende kenmerken zijn bekend\",\"        de volgende kenmerken zijn niet bekend\")","v":"        de volgende kenmerken zijn niet bekend"},null,null,null,null,null,null,{"$f":"IF($N$8=1,N66=1)","v":false},false,null,null,null,null,null,null,null,null,null,null,null,null,"GC","glauconiet"]
[null,"Specifieke kwaliteit van de partij grond",null,null,null,null,null,null,null,null,null,"Rbk, art. 5.36 lid 1h4",null,null,null,null,null,null,null,null,null,null,null,null,null,null,"GI","gips"]
[null,null,"[rolmenu ↓]",null,null,null,null,null,null,null,null,null,{"$f":"IF($N$8=1,N68=1)","v":true},{"$f":"IF(C68=\"[rolmenu ↓]\",1,0)","v":1},null,null,null,null,null,null,null,null,null,null,null,null,"GL","gley"]
[null,"Kwaliteitsklasse waarin de partij baggerspecie is ingedeeld",null,null,null,null,null,null,null,null,null,null,null,null,null,null,null,null,null,null,null,null,null,null,null,null,"GR","grind"]
[null,"klasse:","[rolmenu ↓]",null,null,null,null,null,null,null,null,null,{"$f":"IF($N$9=1,N70=1)","v":false},{"$f":"IF(C70=\"[rolmenu ↓]\",1,0)","v":1},null,null,null,null,null,null,null,null,null,null,null,null,"GS","glas"]
[null,"Specifieke kwaliteit van de partij baggerspecie",null,null,null,{"$f":"IF(N71=TRUE,\"        de volgende kenmerken zijn bekend\",\"        de volgende kenmerken zijn niet bekend\")","v":"        de volgende kenmerken zijn niet bekend"},null,null,null,null,null,null,null,false,null,null,null,null,null,null,null,null,null,null,null,null,"HK","houtskool"]
[null,null,"[rolmenu ↓]",null,null,null,null,null,null,null,null,null,{"$f":"IF($N$9=1,N72=1)","v":false},{"$f":"IF(C72=\"[rolmenu ↓]\",1,0)","v":1},null,null,null,null,null,null,null,null,null,null,null,null,"HO","houtskool"]
[null,"Is er sprake van eventueel andere op de ontgravingslocatie aanwezige relevante parameters (concentraties, emissies, waarden)?",null,null,null,null,null,null,null,null,null,"Rbk, art. 5.36 lid 1h6",null,null,null,null,null,null,null,null,null,null,null,null,null,null,"HU","huisvuil"]
[null,null,{"$f":"IF(N74=TRUE,\"ja\",\"nee\")","v":"nee"},null,null,null,null,null,null,null,null,null,null,false]
[null,"<conc. etc.>",null,null,null,null,null,null,null,null,null,null,{"$f":"IF(B75=\"<conc. etc.>\",1,0)","v":1},null,null,null,null,null,null,null,null,null,null,null,null,null,"KA","kalk"]
[null,"Aard van het (antropogene) bodemvreemde materiaal",null,null,null,null,null,null,null,null,null,"Rbk, art. 5.36 lid 1h5",null,null,null,null,null,null,null,null,null,null,null,null,null,null,"KE","keileem"]
[null,"<aard bodemvreemd>",null,null,null,null,null,null,null,null,null,null,{"$f":"IF(B77=\"<aard bodemvreemd>\",1,0)","v":1},null,null,null,null,null,null,null,null,null,null,null,null,null,"KG","kolengruis"]
[null,"Hoeveelheid van het (antropogene) materiaal (% V/V)",null,null,null,null,null,null,null,null,null,"Rbk, art. 5.36 lid 1h5",null,null,null,null,null,null,null,null,null,null,null,null,null,null,"KL","klei"]
[null,"<hoeveelheid bodemvreemd (%V/V)>",null,null,null,null,null,null,null,null,null,null,{"$f":"IF(B79=\"<hoeveelheid bodemvreemd (%V/V)>\",1,0)","v":1},null,null,null,null,null,null,null,null,null,null,null,null,null,"KO","kolen"]
[null,null,null,null,null,null,null,null,null,null,null,null,null,null,null,null,null,null,"[rolmenu ↓]",null,null,null,null,null,null,null,"KR","krijt"]
[null,"De partij grond of baggerspecie waarop de verklaring betrekking heeft mag alleen toegepast woorden op een toepassingslocatie waarvoor de verklaring geldigheid heeft.",null,null,null,null,null,null,null,null,null,"Rbk, art. 5.36 lid 1b",null,null,null,null,null,null,"'emissiearme baggerspecie' voor grootschalig toepassen baggerspecie op of in de landbodem of een oppervlaktewaterlichaam",null,null,null,null,null,null,null,"KS","kalksteen"]
[null,null,null,null,null,null,null,null,null,null,null,"NvT art. 5.36",null,null,null,null,null,null,"'voor toepassen in een diepe plas geschikte grond'",null,null,null,null,null,null,null,"LE","leem"]
[null," ",null,null,null,null,null,null,null,null,null,null,null,null,null,null,null,null,"'voor toepassen als afdeklaag in een diepe plas geschikte grond'",null,null,null,null,null,null,null,"LL","lavalith"]
[null,"Bij deze MV horen",null,0,"bijlagen"]
[]
[null,"(geautoriseerd) natuurlijk persoon die de milieuverklaring afgeeft",null,null,"naam:",null,"<naam>",null,null,null,null,"Rbk, art. 5.36 lid 1j",{"$f":"IF(G86=\"<naam>\",1,0)","v":1},null,null,null,null,null,"'tarragrond' voor het toepassen van tarragrond op de landbodem",null,null,null,null,null,null,null,"LO","löss"]
[null,null,null,null,"datum:",null,"<datum>",null,"<uurtijd>",null,null,null,{"$f":"IF(G87=\"<datum>\",1,0)","v":1},null,null,null,null,null,"n.v.t.",null,null,null,null,null,null,null,"LS","leisteen"]
[null,null,null,null,"ondertekening:",null,"<handtekening>",null,null,null,null,null,{"$f":"IF(G88=\"<handtekening>\",1,0)","v":1},null,null,null,null,"Bagger","[rolmenu ↓]",null,null,null,null,null,null,null,"ME","metaal"]
[null,null,null,null,null,null,null,null,null,null,null,null,{"$f":"IF(I87=\"<uurtijd>\",1,0)","v":1},null,null,null,null,null,"Algemeen toepasbaar (AW2000)",null,null,null,null,null,null,null,"MI","mijnsteen"]
[null,null,null,null,null,null,null,null,null,null,null,null,null,null,null,null,null,null,"Licht verontreinigd",null,null,null,null,null,null,null,"OE","oer"]
[null,null,null,null,null,null,null,null,null,null,null,null,null,null,null,null,null,null,"Matig verontreinigd",null,null,null,null,null,null,null,"OF","olie(fractie)"]
[null,"Disclaimer. Deze verklaring is geldig op het moment van ondertekening. Wat er daarna met de partij gebeurt is voor verantwoordelijkheid van de daadwerkelijke uitvoerder.",null,null,null,null,null,null,null,null,null,null,null,null,null,null,null,null,"'emissiearme baggerspecie' voor grootschalig toepassen baggerspecie op of in de landbodem of een oppervlaktewaterlichaam",null,null,null,null,null,null,null,"PU","puin"]
[null,null,null,null,null,null,null,null,null,null,null,null,null,null,null,null,null,null,"'voor verspreiden op de landbodem geschikte baggerspecie' voor het verspreiden van baggerspecie op de landbodem",null,null,null,null,null,null,null,"RI","tietresten"]
[null,null,null,null,null,null,null,null,null,null,null,null,null,null,null,null,null,null,"'voor verspreiden in zoet oppervlaktewater geschikte baggerspecie'",null,null,null,null,null,null,null,"RO","roest"]
[null,null,null,null,null,null,null,null,null,null,null,null,null,null,null,null,null,null,"'voor verspreiden in zout oppervlaktewater geschikte baggerspecie'",null,null,null,null,null,null,null,"RP","repac"]
[null,null,null,null,null,null,null,null,null,null,null,null,null,null,null,null,null,null,"'voor toepassen in een diepe plas geschikte baggerspecie'",null,null,null,null,null,null,null,"SB","slib"]
[null,null,null,null,null,null,null,null,null,null,null,null,null,null,null,null,null,null,"'voor toepassing als deklaag in een diepe plas geschikte baggerspecie'",null,null,null,null,null,null,null,"SC","schelpen"]
[null,null,null,null,null,null,null,null,null,null,null,null,null,null,null,null,null,null,"n.v.t.",null,null,null,null,null,null,null,"SI","sintels"]
[null,null,null,null,null,null,null,null,null,null,null,null,null,null,null,null,null,null,null,null,null,null,null,null,null,null,"SL","slakken"]
[null,null,null,null,null,null,null,null,null,null,null,null,null,null,null,null,null,null,null,null,null,null,null,null,null,null,"SO","stoll"]
[null,null,null,null,null,null,null,null,null,null,null,null,null,null,null,null,null,null,null,null,null,null,null,null,null,null,"ST","stenen"]
[null,null,null,null,null,null,null,null,null,null,null,null,null,null,null,null,null,null,null,null,null,null,null,null,null,null,"SX","silex"]
[null,null,null,null,null,null,null,null,null,null,null,null,null,null,null,null,null,null,null,null,null,null,null,null,null,null,"TA","teelaarde"]
[null,null,null,null,null,null,null,null,null,null,null,null,null,null,null,null,null,null,null,null,null,null,null,null,null,null,"TX","textiel"]
[null,null,null,null,null,null,null,null,null,null,null,null,null,null,null,null,null,null,null,null,null,null,null,null,null,null,"VE","veen"]
[null,null,null,null,null,null,null,null,null,null,null,null,null,null,null,null,null,null,null,null,null,null,null,null,null,null,"VF","verf"]
[null,null,null,null,null,null,null,null,null,null,null,null,null,null,null,null,null,null,null,null,null,null,null,null,null,null,"VL","vliegas"]
[null,null,null,null,null,null,null,null,null,null,null,null,null,null,null,null,null,null,null,null,null,null,null,null,null,null,"WO","wortels"]
[null,null,null,null,null,null,null,null,null,null,null,null,null,null,null,null,null,null,null,null,null,null,null,null,null,null,"YZ","ijzer"]
[null,null,null,null,null,null,null,null,null,null,null,null,null,null,null,null,null,null,null,null,null,null,null,null,null,null,"ZA","zand"]
[null,null,null,null,null,null,null,null,null,null,null,null,null,null,null,null,null,null,null,null,null,null,null,null,null,null,"PS","piepschuim"]
[]
[]
[]
[]
[]
[]
[]
[]
[]
{"$rows_left_out":30}
{"sheet":"Afbeeldingen","index":1,"n_rows":39,"n_cols":3,"rows_kept":39,"cut":false,"hidden":false,"merged":[]}
[null,null,"u kunt in voorkomende gevallen de gemeentenamen en gemeentelogos vervangen door die van uw keuze"]
["[rolmenu ↓]",null,{"$f":"INDEX(Afbeeldingen!$B$3:$B$9,MATCH(#REF!,Afbeeldingen!$A$3:$A$9,0))","v":{"$error":"#REF!"}}]
["Beek",null,"Beek"]
["Brunssum"]
["Eijsden-Margraten"]
["Gulpen-Wittem"]
["Heerlen"]
["Kerkrade"]
["Landgraaf"]
["Maastricht"]
["Meerssen"]
["Beekdaelen"]
["Beekdaelen"]
["Beekdaelen"]
["Simpelveld"]
["Sittard-Geleen"]
["Stein"]
["Vaals"]
["Valkenburg a/d Geul"]
["Voerendaal"]
["IMD-BNS"]
["Provincie Limburg"]
["Mook en Middelaar"]
["Gennep"]
["Bergen"]
["Venray"]
["Horst aan de Maas"]
["Venlo"]
["Peel en Maas"]
["Nederweert"]
["Beesel"]
["Leudal"]
["Weert"]
["Roermond"]
["Maasgouw"]
["Roerdalen"]
["Echt-Susteren"]
["Servicecentrum MER"]
["volgt"]