{"text_format":"1","workbook":"xlsx","n_sheets":2,"sheets":["Milieu Verklaring","Afbeeldingen"],"not_rendered":{"charts":0,"images":37,"macros":1,"external_links":0,"defined_names":3,"comments":1,"pivot_tables":0},"unopened":[],"bounds":{"document_bytes":16777216,"sheet_cells":100000,"rows_first":2000,"rows_last":500,"rows_between":2000,"halvings":0,"cell_chars":16384,"cell_head_chars":4096},"cells_cut":0,"cells_raw":0,"read":"whole","date_system":"1900"}

{"sheet":"Milieu Verklaring","index":0,"n_rows":122,"n_cols":36,"rows_kept":122,"cut":false,"hidden":false,"merged":[[120,1,121,8],[3,1,3,8],[16,1,17,8],[108,1,108,8],[109,1,109,5],[110,1,110,5],[114,1,116,3],[114,6,114,8],[115,6,115,7],[99,1,99,3],[101,1,101,8],[102,1,102,8],[103,1,103,8],[104,1,106,8],[90,1,90,8],[94,16,94,17],[95,1,95,2],[95,3,95,4],[95,16,95,17],[97,1,97,3],[94,1,94,2],[94,3,94,4],[94,6,94,8],[91,3,91,5],[91,1,91,2],[86,1,86,8],[87,1,87,8],[88,1,88,8],[89,1,89,8],[5,6,6,8],[34,1,34,8],[66,6,66,7],[71,2,71,6],[75,2,75,6],[39,1,39,8],[38,1,38,8],[42,1,42,8],[20,1,20,8],[21,1,21,8],[36,1,36,8],[37,1,37,8],[73,2,73,4],[46,1,46,8],[69,2,69,4],[57,1,57,8],[78,1,78,8],[54,1,54,8],[76,1,76,8],[70,1,70,8],[48,3,48,8],[50,3,50,8],[52,3,52,8],[26,2,26,4],[55,3,55,6],[43,1,43,8],[45,1,45,8],[44,1,44,8],[22,1,22,8],[116,6,118,8],[0,1,0,8],[2,1,2,8],[27,1,27,5],[14,1,14,8],[18,1,18,8],[15,1,15,8],[80,1,80,8],[82,1,82,8],[79,1,79,8],[81,1,81,8],[29,1,29,3],[40,1,40,8],[31,1,31,3]]}
[null,"Milieuverklaring (bestemd voor eenmalig gebruik)",null,null,null,null,null,null,null,null,null,"Rbk 2022, par. 5.3 MV op grond van een BKK"]
[]
[null,"Verklaring gebaseerd op een vast gestelde bodemkwaliteitskaart (BKK)",null,null,null,null,null,null,null,null,null,"Rbk, par. 5.3"]
[null,"Gecombineerde verklaring op basis van een BKK voor ontgraven partij en ontvangende bodem voor het beheergebied van de betreffende BKK"]
[]
[null,"Uniek nummer van de verklaring:",null,null,null,null,"<nummer>",null,null,null,null,"Rbk, art. 5.36 lid 1i",{"$f":"IF(G6=\"<nummer>\",1,0)","v":1}]
[null,null,null,null,null,null,null,null,null,null,null,null,null,null,null,null,null,"Grond","[rolmenu ↓]"]
[null,null,null,null,null,null,null,null,null,null,null,null,null,null,null,null,null,null,"Landbouw/Natuur (AW2000)"]
[null,"Dit deel van de verklaring heeft betrekking op ",null,null,null,"de te ontgraven partij",null,null,null,null,null,null,null,null,null,null,null,null,"Wonen"]
[null,null,null,null,null,null,null,null,null,null,null,null,null,null,null,null,null,null,"Industrie"]
[null,"Deze verklaring heeft betrekking op een partij",null,null,null,null,"grond",null,null,null,null,"Rbk, art. 5.36 lid 1a",true,{"$f":"IF(AND(M11=TRUE,M12=FALSE),1,0)","v":1},null,null,null,null,"Matig verontreinigd"]
[null,null,null,{"$f":"IF(AND(N11=0,N12=0),\"1 hokje aanvinken\",\"\")","v":""},null,null,"baggerspecie",null,null,null,null,"Rbk, art. 5.36 lid 1a",false,{"$f":"IF(AND(M11=FALSE,M12=TRUE),1,0)","v":0},null,null,null,null,"Sterk verontreinigd"]
[null,null,null,null,null,null,null,null,null,null,null,null,null,null,null,null,null,null,"Niet-toepasbaar"]
[null,"Beperking van de geldigheid van de MV",null,null,null,null,null,null,null,null,null,"Rbk, art. 5.36 lid 1b",null,null,null,null,null,null,"n.v.t."]
[null,"\"Van deze verklaring mag bij het toepassen van de partij grond of baggerspecie waarvoor zij is afgegeven, alleen gebruik"]
[null,"worden gemaakt wanneer dit volgens artikel 5.32 van de Regeling bodemkwaliteit 2022 is toegestaan.\""]
[null,"Een verklaring op grond van een bodemkwaliteitskaart over de kwaliteit van de bodem op de toepassingslocatie wordt niet afgegeven als voor de bodemlocatie al een verklaring op grond van een bodemonderzoek is afgegeven."]
[]
[]
[null,"Naam en adres van de persoon die onderhavige verklaring afgeeft",null,null,null,null,null,null,null,null,null,"Rbk, art. 5.36 lid 1c"]
[null,"<naam>",null,null,null,null,null,null,null,null,null,null,{"$f":"IF(B21=\"<naam>\",1,0)","v":1}]
[null,"<postcode en plaats>",null,null,null,null,null,null,null,null,null,null,{"$f":"IF(B22=\"<postcode en plaats>\",1,0)","v":1}]
[null,"<straatnaam en nummer>",null,null,null,null,null,null,null,null,null,null,{"$f":"IF(B23=\"<straatnaam en nummer>\",1,0)","v":1}]
[]
[]
[null,"Bodemkwaliteitskaart die die de grondslag biedt voor de afgegeven MV:",null,null,null,null,null,null,null,null,null,"Rbk, art. 5.36 lid 1d",null,null,null,null,null,null,null,null,null,null,null,null,null,null,null,null,null,null,null,"zone Sit-Gel","[rolmenu ↓]",null,"bodemlaag","[rolmenu ↓]"]
[null,"Gemeente","[rolmenu ↓]",null,null,null,null,null,null,null,null,null,{"$f":"IF(C27=\"[rolmenu ↓]\",1,0)","v":1},null,null,null,null,"[rolmenu ↓]","[rolmenu ↓]",null,null,null,null,null,null,null,null,null,null,null,null,null,"Wonen \"oud\"",null,null,"0,0-0,5 m-mv"]
[null,{"$f":"IF(C27=\"[rolmenu ↓]\",\"BKK\",VLOOKUP(C27,R28:S63,2,FALSE))","v":"BKK"},null,null,null,null,null,null,null,null,null,null,null,null,null,null,null,"Beek","Bodemfunctieklassenkaart en bodemkwaliteitskaart Gemeenten Beek, Beekdaelen en Stein"]
[null,"De ontgravingslocatie ligt in de zone:",null,null,null,null,null,null,null,null,null,"Rbk, art. 5.36 lid 1d",null,null,null,null,null,"Brunssum","BKK",null,null,null,null,null,null,null,null,null,null,null,null,null,"Wonen \"nieuw\"",null,null,"0,5-3,5 m-mv"]
[null,"[rolmenu ↓]",null,null,null,null,null,null,null,null,null,null,{"$f":"IF(B30=\"[rolmenu ↓]\",1,0)","v":1},null,null,null,null,"Eijsden-Margraten","BKK",null,null,null,null,null,null,null,null,null,null,null,null,null,"Industrie",null,null,"0,5-2,0 m-mv"]
[null,"De ontgraving vindt plaats uit de bodemlaag:",null,null,null,null,null,null,null,null,null,"Rbk, art. 5.36 lid 1d",null,null,null,null,null,"Gulpen-Wittem","BKK",null,null,null,null,null,null,null,null,null,null,null,null,null,"Buitengebied"]
[null,"[rolmenu ↓]",null,null,null,null,null,null,null,null,null,null,{"$f":"IF(B32=\"[rolmenu ↓]\",1,0)","v":1},null,null,null,null,"Heerlen","BKK"]
[null,null,null,null,null,null,null,null,null,null,null,null,null,null,null,null,null,"Kerkrade","BKK"]
[null,"Het unieke nummer van het rapport van het vooronderzoek (vo) NEN5725/NEN5717 [partij]",null,null,null,null,null,null,null,null,null,"Rbk, art. 5.36 lid 1e",null,null,null,null,null,"Landgraaf","BKK"]
[null,"<uniek nummer rapport>",null,null,null,null,null,null,null,null,null,null,{"$f":"IF(B35=\"<uniek nummer rapport>\",1,0)","v":1},null,null,null,null,"Maastricht","BKK"]
[null,"Naam en adres van de persoon die het vooronderzoek heeft verricht",null,null,null,null,null,null,null,null,null,"Rbk, art. 5.36 lid 1g",null,null,null,null,null,"Meerssen","BKK"]
[null,"<naam onderzoeksbureau en naam contactpersoon>",null,null,null,null,null,null,null,null,null,null,{"$f":"IF(B37=\"<naam onderzoeksbureau en naam contactpersoon>\",1,0)","v":1},null,null,null,null,"Beekdaelen","Bodemfunctieklassenkaart en bodemkwaliteitskaart Gemeenten Beek, Beekdaelen en Stein"]
[null,"<postcode en plaatsnaam>",null,null,null,null,null,null,null,null,null,null,{"$f":"IF(B38=\"<postcode en plaatsnaam>\",1,0)","v":1},null,null,null,null,"Beekdaelen","Bodemfunctieklassenkaart en bodemkwaliteitskaart Gemeenten Beek, Beekdaelen en Stein"]
[null,"<straatnaam en nummer>",null,null,null,null,null,null,null,null,null,null,{"$f":"IF(B39=\"<straatnaam en nummer>\",1,0)","v":1},null,null,null,null,"Beekdaelen","Bodemfunctieklassenkaart en bodemkwaliteitskaart Gemeenten Beek, Beekdaelen en Stein"]
[]
[null,"Is er een aanvullend onderzoek onderzoek NEN5740/NEN5720 uitgevoerd?",null,null,null,null,null,null,null,null,null,"Rbk, art. 5.36 lid 1e",null,null,null,null,null,"Sittard-Geleen","Bodemkwaliteits- en bodemfunctieklassenkaart gemeente Sittard-Geleen 2021-2025"]
[null,null,{"$f":"IF(N42=TRUE,\"ja\",\"nee\")","v":"nee"},null,null,null,null,null,null,null,null,null,null,false,null,null,null,"Stein","Bodemfunctieklassenkaart en bodemkwaliteitskaart Gemeenten Beek, Beekdaelen en Stein"]
[null,"<uniek nummer rapport>",null,null,null,null,null,null,null,null,null,null,{"$f":"IF(B43=\"<uniek nummer rapport>\",1,0)","v":1},null,null,null,null,"Vaals","BKK"]
[null,"Naam en adres van de persoon die het aanvullend onderzoek (a.o.) heeft verricht",null,null,null,null,null,null,null,null,null,"Rbk, art. 5.36 lid 1g",null,null,null,null,null,"Valkenburg a/d Geul","BKK"]
[null,"<naam onderzoeksbureau en naam contactpersoon>",null,null,null,null,null,null,null,null,null,null,{"$f":"IF(B45=\"<naam onderzoeksbureau en naam contactpersoon>\",1,0)","v":1},null,null,null,null,"Voerendaal","BKK"]
[null,"<postcode en plaatsnaam>",null,null,null,null,null,null,null,null,null,null,{"$f":"IF(B46=\"<postcode en plaatsnaam>\",1,0)","v":1},null,null,null,null,"IMD-BNS","BKK"]
[null,"<straatnaam en nummer>",null,null,null,null,null,null,null,null,null,null,{"$f":"IF(B47=\"<straatnaam en nummer>\",1,0)","v":1},null,null,null,null,"Provincie Limburg","BKK"]
[null,{"$f":"IF(N48=TRUE,\"      het a.o. geeft voldoende informatie over de aanwezigheid van stoffen uit bijlage B waarover de BKK geen informatie geeft\",\"      het a.o. geeft niet voldoende informatie over de aanwezigheid van stoffen uit bijlage B waarover de BKK geen informatie geeft\")","v":"      het a.o. geeft niet voldoende informatie over de aanwezigheid van stoffen uit bijlage B waarover de BKK geen informatie geeft"},null,null,null,null,null,null,null,null,null,"Rbk, art 5.36 lid 2",false,false,null,null,null,"Gennep","BKK"]
[null,"concentratie van deze stoffen:",null,{"$f":"IF(N48=TRUE,\"zie bijlage\",\"\")","v":""},null,null,null,null,null,null,null,null,{"$f":"IF(ISTEXT(D49)=TRUE,1,0)","v":1},null,null,null,null,"Bergen","BKK"]
[null,{"$f":"IF(N50=TRUE,\"      het a.o. geeft voldoende info over de aanwezigheid van andere stoffen dan bijl.B waarover de BKK geen informatie geeft\",\"      het a.o. geeft niet voldoende info over de aanwezigheid van andere stoffen dan bijl.B waarover de BKK geen informatie geeft\")","v":"      het a.o. geeft niet voldoende info over de aanwezigheid van andere stoffen dan bijl.B waarover de BKK geen informatie geeft"},null,null,null,null,null,null,null,null,null,"Rbk, art 5.36 lid 2",null,false,null,null,null,"Venray","BKK"]
[null,"concentratie van deze stoffen:",null,{"$f":"IF(N50=TRUE,\"zie bijlage\",\"\")","v":""},null,null,null,null,null,null,null,null,{"$f":"IF(ISTEXT(D51)=TRUE,1,0)","v":1},null,null,null,null,"Horst aan de Maas","BKK"]
[null,{"$f":"IF(N52=TRUE,\"      het a.o. geeft voldoende info over de aanwezigheid van bodemvreemd materiaal waarover de BKK geen informatie geeft\",\"      het a.o. geeft niet voldoende info over de aanwezigheid van bodemvreemd materiaal waarover de BKK geen informatie geeft\")","v":"      het a.o. geeft niet voldoende info over de aanwezigheid van bodemvreemd materiaal waarover de BKK geen informatie geeft"},null,null,null,null,null,null,null,null,null,"Rbk, art 5.36 lid 2",null,false,null,null,null,"Venlo","BKK"]
[null,"aard en hoeveelheid b.v.m.:",null,{"$f":"IF(N52=TRUE,\"zie bijlage\",\"\")","v":""},null,null,null,null,null,null,null,null,{"$f":"IF(ISTEXT(D53)=TRUE,1,0)","v":1},null,null,null,null,"Peel en Maas","BKK"]
[null,null,null,null,null,null,null,null,null,null,null,null,null,null,null,null,null,"Nederweert","BKK"]
[null,"Concludeert het vooronderzoek dat de BKK een getrouw en actueel beeld van de kwaliteit van de bodem op de ontgravingslocatie geeft?",null,null,null,null,null,null,null,null,null,"Rbk, art. 5.36 lid 1f",null,null,null,null,null,"Beesel","BKK"]
[null,null,{"$f":"IF(M56=TRUE,\"ja\",\"nee\")","v":"ja"},{"$f":"IF(C56=\"nee\",\"Afgifte van onderhavige MV is niet mogelijk\",\"\")","v":""},null,null,null,null,null,null,null,null,true,false,null,null,null,"Leudal","BKK"]
[null,"onderbouwing van deze conclusie:",null,null,null,null,null,null,null,null,null,"Rbk, art. 5.36 lid 1f",null,null,null,null,null,"Weert","BKK"]
[null,"<onderbouwing>",null,null,null,null,null,null,null,null,null,null,{"$f":"IF(B58=\"<onderbouwing>\",1,0)","v":1},null,null,null,null,"Roermond","BKK"]
[null,"Nauwkeurige omschrijving van het type grond of baggerspecie",null,null,null,null,null,null,null,null,null,"Rbk, art. 5.36 lid 1h1",null,null,null,null,null,"Maasgouw","BKK",null,"code bodemsoort","bodemsoort","code toevoeging bodemsoort","toevoeging","code gradatie toevoeging bodemsoort","gradatie","code bijzonderbestanddeel","bijzonderbestanddeel","code gradatie bijzonder bestanddeel","gradatie"]
[null,"type grond",null,"[rolmenu ↓]",{"$f":"IF(D60=\"[rolmenu ↓]\",\"\",VLOOKUP(D60,U60:V66,2,FALSE))","v":""},{"$f":"IF(N60=TRUE,\"        de volgende kenmerken zijn bekend\",\"        de volgende kenmerken zijn niet bekend\")","v":"        de volgende kenmerken zijn niet bekend"},null,null,null,null,null,null,{"$f":"IF(D60=\"[rolmenu ↓]\",1,0)","v":1},false,null,null,null,"Roerdalen","BKK",null,"[rolmenu ↓]","[rolmenu ↓]","[rolmenu ↓]","[rolmenu ↓]","[rolmenu ↓]","[rolmenu ↓]","[rolmenu ↓]","[rolmenu ↓]","[rolmenu ↓]","[rolmenu ↓]"]
[null,"toevoeging",null,"[rolmenu ↓]",{"$f":"IF(D61=\"[rolmenu ↓]\",\"\",VLOOKUP(D61,W60:X66,2,FALSE))","v":""},null,null,null,null,null,null,null,{"$f":"IF(D61=\"[rolmenu ↓]\",1,0)","v":1},null,null,null,null,"Echt-Susteren","BKK",null,"L","leem","S","siltig",1,"zwak","AA","aardewerk",1,"zwak 1-5%"]
[null,"gradatie",null,"[rolmenu ↓]",{"$f":"IF(D62=\"[rolmenu ↓]\",\"\",VLOOKUP(D62,Y60:Z65,2,FALSE))","v":""},null,null,null,null,null,null,null,1,null,null,null,null,"Servicecentrum MER","BKK",null,"Z","zand","Z","zandig",2,"matig","AB","asbest",2,"matig 5-10%"]
[null,"bijzonder bestanddeel",null,"[rolmenu ↓]",{"$f":"IF(D63=\"[rolmenu ↓]\",\"\",VLOOKUP(D63,AA60:AB123,2,FALSE))","v":""},"[rolmenu ↓]",{"$f":"IF(F63=\"[rolmenu ↓]\",\"\",VLOOKUP(F63,AA60:AB123,2,FALSE))","v":""},"[rolmenu ↓]",{"$f":"IF(H63=\"[rolmenu ↓]\",\"\",VLOOKUP(H63,AA60:AB123,2,FALSE))","v":""},null,null,null,1,null,null,null,null,"volgt","BKK",null,"K","klei","K","kleiig",3,"sterk","AF","afval",3,"sterk 10-20%"]
[null,"gradatie",null,"[rolmenu ↓]",{"$f":"IF(D64=\"[rolmenu ↓]\",\"\",VLOOKUP(D64,AC60:AD70,2,FALSE))","v":""},null,null,null,null,null,null,null,1,null,null,null,null,null,null,null,"G","grind","G","grindig",4,"uiterst","AS","asfalt",4,"uiterst 20-50%"]
[null,null,null,null,null,null,null,null,null,null,null,null,null,null,null,null,null,null,null,null,"V","veen","H","humeus",null,null,"BA","baksteen",5,"volledig >50%"]
[null,"De grootte van de partij",null,null,null,null,null,null,null,null,null,"Rbk, art. 5.36 lid 1h2",null,null,null,null,null,null,null,null,"Divers","zie bijlage",null,null,null,null,"BE","beton",6,"sporen"]
[null,"<ton>","ton","<m3>","m3",null,{"$f":"IF(AND(M67=TRUE,N67=TRUE),\"dichtheid (ton/m3): \",\"\")","v":""},null,{"$f":"IF(AND(M67=TRUE,N67=TRUE),B67/D67,\"\")","v":""},null,null,null,{"$f":"ISNUMBER(B67)","v":false},{"$f":"ISNUMBER(D67)","v":false},null,null,null,null,null,null,null,null,null,null,null,null,"BI","bitumen",7,"resten"]
[null,null,null,null,null,null,null,null,null,null,null,null,null,null,null,null,null,null,null,null,null,null,null,null,null,null,"BL","ballast",8,"brokken"]
[null,"Kwaliteitsklasse waarin de partij grond is ingedeeld",null,null,null,null,null,null,null,null,null,"Rbk, art. 5.36 lid 1h3",null,null,null,null,null,null,null,null,null,null,null,null,null,null,"BR","bruinkool",9,"laagjes"]
[null,"klasse:","[rolmenu ↓]",null,null,{"$f":"IF(N70=TRUE,\"        de volgende kenmerken zijn bekend\",\"        de volgende kenmerken zijn niet bekend\")","v":"        de volgende kenmerken zijn niet bekend"},null,null,null,null,null,null,{"$f":"IF($N$11=1,N70=1)","v":false},false,null,null,null,null,null,null,null,null,null,null,null,null,"GC","glauconiet"]
[null,"Specifieke kwaliteit van de partij grond",null,null,null,null,null,null,null,null,null,"Rbk, art. 5.36 lid 1h4",null,null,null,null,null,null,null,null,null,null,null,null,null,null,"GI","gips"]
[null,null,"[rolmenu ↓]",null,null,null,null,null,null,null,null,null,{"$f":"IF($N$11=1,N72=1)","v":true},{"$f":"IF(C72=\"[rolmenu ↓]\",1,0)","v":1},null,null,null,null,null,null,null,null,null,null,null,null,"GL","gley"]
[null,"Kwaliteitsklasse waarin de partij baggerspecie is ingedeeld",null,null,null,null,null,null,null,null,null,null,null,null,null,null,null,null,null,null,null,null,null,null,null,null,"GR","grind"]
[null,"klasse:","[rolmenu ↓]",null,null,null,null,null,null,null,null,null,{"$f":"IF($N$12=1,N74=1)","v":false},{"$f":"IF(C74=\"[rolmenu ↓]\",1,0)","v":1},null,null,null,null,null,null,null,null,null,null,null,null,"GS","glas"]
[null,"Specifieke kwaliteit van de partij baggerspecie",null,null,null,{"$f":"IF(N75=TRUE,\"        de volgende kenmerken zijn bekend\",\"        de volgende kenmerken zijn niet bekend\")","v":"        de volgende kenmerken zijn niet bekend"},null,null,null,null,null,null,null,false,null,null,null,null,null,null,null,null,null,null,null,null,"HK","houtskool"]
[null,null,"[rolmenu ↓]",null,null,null,null,null,null,null,null,null,{"$f":"IF($N$12=1,N76=1)","v":false},{"$f":"IF(C76=\"[rolmenu ↓]\",1,0)","v":1},null,null,null,null,null,null,null,null,null,null,null,null,"HO","houtskool"]
[null,"Is er sprake van eventueel andere op de ontgravingslocatie aanwezige relevante parameters (concentraties, emissies, waarden)?",null,null,null,null,null,null,null,null,null,"Rbk, art. 5.36 lid 1h6",null,null,null,null,null,null,null,null,null,null,null,null,null,null,"HU","huisvuil"]
[null,null,{"$f":"IF(N78=TRUE,\"ja\",\"nee\")","v":"nee"},null,null,null,null,null,null,null,null,null,null,false,null,null,null,null,null,null,null,null,null,null,null,null,"KA","kalk"]
[null,"<concentraties etc. (evtueel in bijlage)>",null,null,null,null,null,null,null,null,null,null,{"$f":"IF(B79=\"<conc. etc.>\",1,0)","v":0},null,null,null,null,null,null,null,null,null,null,null,null,null,"KE","keileem"]
[null,"Aard van het (antropogene) bodemvreemde materiaal",null,null,null,null,null,null,null,null,null,"Rbk, art. 5.36 lid 1h5",null,null,null,null,null,null,null,null,null,null,null,null,null,null,"KG","kolengruis"]
{"$rows_left_out":43}
{"sheet":"Afbeeldingen","index":1,"n_rows":39,"n_cols":4,"rows_kept":39,"cut":false,"hidden":false,"merged":[]}
[null,null,null,"u kunt in voorkomende gevallen de gemeentenamen en gemeentelogos vervangen door die van uw keuze"]
["[rolmenu ↓]",null,{"$f":"INDEX(Afbeeldingen!$B$3:$B$9,MATCH(#REF!,Afbeeldingen!$A$3:$A$9,0))","v":{"$error":"#REF!"}}]
["Beek",null,"Beek"]
["Brunssum"]
["Eijsden-Margraten"]
["Gulpen-Wittem"]
["Heerlen"]
["Kerkrade"]
["Landgraaf"]
["Maastricht"]
["Meerssen"]
["Beekdaelen"]
["Beekdaelen"]
["Beekdaelen"]
["Simpelveld"]
["Sittard-Geleen"]
["Stein"]
["Vaals"]
["Valkenburg a/d Geul"]
["Voerendaal"]
["IMD-BNS"]
["Provincie Limburg"]
["Mook en Middelaar"]
["Gennep"]
["Bergen"]
["Venray"]
["Horst aan de Maas"]
["Venlo"]
["Peel en Maas"]
["Nederweert"]
["Beesel"]
["Leudal"]
["Weert"]
["Roermond"]
["Maasgouw"]
["Roerdalen"]
["Echt-Susteren"]
["Servicecentrum MER"]
["volgt"]